{"text_format":"1","workbook":"xlsx","n_sheets":3,"sheets":["DE-FT-15 (Pág 1 de 2)","DE-FT-15 (Pág 2 de 2)","Hoja3"],"not_rendered":{"charts":8,"images":1,"macros":1,"external_links":0,"defined_names":6,"comments":1,"pivot_tables":0},"unopened":[],"bounds":{"document_bytes":16777216,"sheet_cells":100000,"rows_first":2000,"rows_last":500,"rows_between":2000,"halvings":0,"cell_chars":16384,"cell_head_chars":4096},"cells_cut":0,"cells_raw":0,"read":"whole","date_system":"1900"}

{"sheet":"DE-FT-15 (Pág 1 de 2)","index":0,"n_rows":140,"n_cols":57,"rows_kept":140,"cut":false,"hidden":false,"merged":[[14,0,14,1],[14,2,14,18],[15,5,15,9],[15,10,15,12],[5,15,5,18],[1,15,1,18],[4,15,4,18],[28,16,28,18],[30,16,30,18],[29,16,29,18],[12,2,12,18],[7,0,7,18],[1,2,5,14],[8,2,8,9],[8,10,8,11],[8,12,8,14],[9,2,9,14],[8,15,8,16],[8,0,8,1],[1,0,5,1],[10,0,10,1],[9,15,9,16],[9,17,9,18],[10,2,10,18],[139,0,139,18],[67,44,67,56],[68,19,71,30],[68,31,71,43],[68,44,71,56],[54,19,54,30],[54,31,54,43],[54,44,54,56],[55,19,65,30],[55,31,65,43],[55,44,65,56],[137,2,137,9],[138,2,138,9],[127,10,127,18],[134,10,134,18],[135,10,135,18],[137,10,137,18],[138,10,138,18],[135,2,135,9],[73,2,73,9],[74,2,74,9],[77,2,77,9],[92,10,92,18],[76,2,76,9],[39,19,39,25],[79,10,79,18],[79,2,79,9],[28,11,28,15],[29,14,30,15],[29,11,30,13],[35,2,35,9],[36,2,36,9],[34,2,34,9],[29,2,30,4],[29,7,29,8],[29,9,29,10],[30,7,30,8],[30,9,30,10],[39,2,39,13],[72,2,72,9],[69,2,69,9],[67,19,67,30],[51,19,51,25],[51,26,51,37],[67,31,67,43],[51,38,51,49],[47,2,47,13],[51,2,51,13],[41,0,41,1],[70,10,70,18],[69,10,69,18],[126,2,126,9],[126,10,126,18],[127,2,127,9],[134,2,134,9],[80,2,80,9],[80,10,80,18],[78,10,78,18],[82,2,82,9],[82,10,82,18],[125,0,125,18],[83,2,83,9],[83,10,83,18],[84,2,84,9],[84,10,84,18],[85,2,85,9],[85,10,85,18],[86,2,86,9],[86,10,86,18],[91,2,91,9],[91,10,91,18],[92,2,92,9],[32,0,32,18],[34,10,34,18],[35,10,35,18],[24,2,24,8],[16,16,16,18],[18,0,18,18],[20,9,20,11],[21,9,21,11],[15,0,15,1],[21,2,21,8],[19,2,19,8],[23,2,23,8],[19,9,19,11],[25,0,25,1],[25,2,25,8],[20,0,20,1],[19,0,19,1],[33,0,33,1],[35,0,35,1],[15,13,15,15],[23,0,23,1],[48,0,48,1],[16,13,16,15],[68,2,68,9],[71,2,71,9],[70,2,70,9],[20,12,20,18],[20,2,20,8],[19,12,19,13],[19,14,19,18],[22,2,22,8],[16,5,16,9],[16,10,16,12],[54,8,54,18],[55,0,65,18],[46,0,46,1],[50,0,50,1],[49,0,49,1],[33,2,33,18],[52,0,52,1],[47,0,47,1],[51,0,51,1],[28,7,28,10],[34,0,34,1],[21,0,21,1],[9,0,9,1],[11,0,11,1],[2,15,3,18],[11,2,11,18],[72,10,72,18],[43,0,43,1],[44,0,44,1],[36,10,36,18],[12,0,12,1],[21,12,21,18],[22,9,22,18],[23,9,25,18],[22,0,22,1],[29,5,30,6],[28,0,30,1],[13,0,13,1],[13,2,13,18],[28,2,28,6],[24,0,24,1],[27,0,27,18],[16,0,16,1],[15,2,15,4],[15,16,15,18],[16,2,16,4],[36,0,36,1],[39,0,40,1],[42,0,42,1],[90,10,90,18],[38,19,38,37],[81,2,81,9],[81,10,81,18],[41,38,41,49],[41,26,41,37],[41,2,41,13],[41,19,41,25],[47,19,47,25],[47,26,47,37],[47,38,47,49],[38,0,38,18],[54,0,54,7],[68,10,68,18],[73,10,73,18],[74,10,74,18],[75,10,75,18],[78,2,78,9],[39,26,39,37],[39,38,39,49],[45,0,45,1],[71,10,71,18],[67,0,67,18],[68,0,68,1],[76,10,76,18],[77,10,77,18],[75,2,75,9],[98,2,98,9],[98,10,98,18],[99,2,99,9],[99,10,99,18],[87,2,87,9],[87,10,87,18],[88,2,88,9],[88,10,88,18],[89,2,89,9],[89,10,89,18],[90,2,90,9],[101,2,101,9],[101,10,101,18],[102,2,102,9],[102,10,102,18],[103,2,103,9],[103,10,103,18],[104,2,104,9],[104,10,104,18],[93,10,93,18],[93,2,93,9],[100,2,100,9],[100,10,100,18],[94,2,94,9],[94,10,94,18],[95,2,95,9],[95,10,95,18],[96,2,96,9],[96,10,96,18],[97,2,97,9],[97,10,97,18],[105,2,105,9],[105,10,105,18],[106,2,106,9],[106,10,106,18],[107,2,107,9],[107,10,107,18],[116,10,116,18],[117,2,117,9],[117,10,117,18],[108,2,108,9],[108,10,108,18],[109,2,109,9],[109,10,109,18],[110,2,110,9],[110,10,110,18],[111,2,111,9],[111,10,111,18],[112,2,112,9],[112,10,112,18],[123,2,123,9],[123,10,123,18],[41,50,41,56],[47,50,47,56],[51,50,51,56],[39,50,39,56],[38,38,38,56],[118,2,118,9],[118,10,118,18],[119,2,119,9],[119,10,119,18],[120,2,120,9],[120,10,120,18],[121,2,121,9],[121,10,121,18],[122,2,122,9],[122,10,122,18],[113,2,113,9],[113,10,113,18],[114,2,114,9],[114,10,114,18],[115,2,115,9],[115,10,115,18],[116,2,116,9],[128,2,128,9],[129,2,129,9],[130,2,130,9],[131,2,131,9],[132,2,132,9],[133,2,133,9],[136,2,136,9],[128,10,128,18],[129,10,129,18],[130,10,130,18],[131,10,131,18],[132,10,132,18],[133,10,133,18],[136,10,136,18]]}
[]
[null,null,"HOJA DE VIDA DEL INDICADOR",null,null,null,null,null,null,null,null,null,null,null,null,"Código: DE-FT-15"]
[null,null,null,null,null,null,null,null,null,null,null,null,null,null,null,"Versión: 9"]
[]
[null,null,null,null,null,null,null,null,null,null,null,null,null,null,null,"Pagina:  1 de 2"]
[null,null,null,null,null,null,null,null,null,null,null,null,null,null,null,"Vigente desde: 01/08/2024"]
[]
["INFORMACIÓN BASICA DEL INDICADOR"]
["PROCESO:",null,null,null,null,null,null,null,null,null,"TIPO DE PROCESO:",null,{"$f":"IF(C9=\"\",\"\",VLOOKUP(C9,Hoja3!A1:B17,2,FALSE))","v":""},null,null,"CÓDIGO DEL INDICADOR:",null,{"$f":"IF(C9=\"\",\"\",CONCATENATE(MID(C9,1,2),\"-IG-\"))","v":""}]
["INSTRUMENTO DE PLANEACIÓN:",null,null,null,null,null,null,null,null,null,null,null,null,null,null,"No. PROYECTO DE INVERSIÓN:"]
["OBJETIVO DEL PROCESO / PROYECTO DE INVERSIÓN / OBJETIVO ESTRATEGICO ASOCIADO:"]
["META ASOCIADA:"]
["NOMBRE DEL INDICADOR:"]
["PROPOSITO DEL INDICADOR:"]
["ACLARACIONES PARA LA ADECUADA MEDICIÓN DEL INDICADOR:"]
["TIPO DE INDICADOR:",null,null,null,null,"FRECUENCIA DE ALIMENTACIÓN Y ANÁLISIS:",null,null,null,null,null,null,null,"VIGENCIA",null,null,{"$f":"IF($C$10=\"\",\"\",IF(OR($C$10=\"Plan Estratégico Institucional PEI\",$C$10=\"Proyecto de Inversión\"),\"Cuatrienal\",\"Anual\"))","v":""}]
["FECHA DE CREACIÓN (dd/mm/aaaa)",null,"2024-01-01",null,null,"FECHA DE REPORTE (dd/mm/aaaa)",null,null,null,null,null,null,null,"PERIODO A REPORTAR"]
[]
["INFORMACIÓN PARA EL CALCULO DEL INDICADOR"]
["TIPO DE FÓRMULA:",null,null,null,null,null,null,null,null,"UNIDAD DE MEDIDA DEL INDICADOR:",null,null,null,null,"Capacitaciones realizadas"]
["VARIABLE 1:",null,null,null,null,null,null,null,null,"FUENTES DE DATOS VARIABLE 1:"]
[{"$f":"IF(C20=\"Sumatoria_de_Una_Variable\",\"NO DILIGENCIAR ESTA CASILLA ----------->\",\"VARIABLE 2:\")","v":"VARIABLE 2:"},null,null,null,null,null,null,null,null,{"$f":"IF(C20=\"Sumatoria_de_Una_Variable\",\"NO DILIGENCIAR ESTA CASILLA ------------------->\",\"FUENTES DE DATOS VARIABLE 2:\")","v":"FUENTES DE DATOS VARIABLE 2:"}]
["TENDENCIA DEL INDICADOR:",null,null,null,null,null,null,null,null,"FÓRMULA DE CÁLCULO:"]
["LÍNEA BASE:",null,null,null,null,null,null,null,null,{"$f":"IF(OR(C20=\"\",C21=\"\"),\"\",\nIF(C20=\"Sumatoria_de_Dos_Variables\",CONCATENATE(\"∑ ( \",C21,\" + \",C22,\" )\"),\nIF(AND(C20=\"División_de_Variables\",M20=\"Porcentaje\"),CONCATENATE(C21,\" \n------------------------------------------------------------------------------------------------------- * 100\n \",C22),\nIF(AND(C20=\"División_de_Variables\",M20<>\"Porcentaje\"),CONCATENATE(C21,\" \n-------------------------------------------------------------------------------------------------------\n \",C22),\nIF(C20=\"Sumatoria_de_Una_Variable\",CONCATENATE(\"∑ ( \",C21,\" )\",\nIF(C20=\"Tasa de Variación\",CONCATENATE(\"( \",C21,\" f  -  \",C21,\" i )\",\"\n------------------------------------------------------------------------------------------------------- * 100\n\",C21,\" i\"),\"\")))))))","v":""}]
["CÁLCULO DE VALORES ACUMULADOS:"]
[{"$f":"CONCATENATE(\"VALOR PROGRAMADO \",UPPER($Q$16),\":\")","v":"VALOR PROGRAMADO :"},null,{"$f":"IF(OR($C$20=\"\",$C$25=\"\",$Q$16=\"\"),\"\",\nIF(AND($C$20=\"Sumatoria_de_Una_Variable\",$C$25=\"No Aplica\"),\"No Aplica\",\nIF(AND($C$20=\"Sumatoria_de_Una_Variable\",$C$25=\"Si Aplica\"),IF($Q$16=\"Cuatrienal\",SUM(C43:BE43),SUM(C43:N43)),\nIF(AND($C$20=\"División_de_Variables\",$C$25=\"No Aplica\"),\"No Aplica\",\nIF(AND($C$20=\"División_de_Variables\",$C$25=\"Si Aplica\"),IF($Q$16=\"Cuatrienal\",IFERROR(AVERAGE(C43:BE43),0),IFERROR(AVERAGE(C43:N43),0)),\nIF(AND($C$20=\"Sumatoria_de_Dos_Variables\",$C$25=\"No Aplica\"),\"No Aplica\",\nIF(AND($C$20=\"Sumatoria_de_Dos_Variables\",$C$25=\"Si Aplica\"),IF($Q$16=\"Cuatrienal\",SUM(C43:BE43),SUM(C43:N43)),\nIF(AND($C$20=\"Tasa de Variación\",$C$25=\"No Aplica\"),\"No Aplica\",\nIF(AND($C$20=\"Tasa de Variación\",$C$20=\"Si Aplica\"),IF($Q$16=\"Cuatrienal\",SUM(C43:BE43),SUM(C43:N43)))))))))))","v":""}]
[]
["RANGOS DE CUMPLIMIENTO"]
["LÍMITES DE CUMPLIMIENTO DEL INDICADOR:",null,"SATISFACTORIO",null,null,null,null,"ACEPTABLE",null,null,null,"INSATISFACTORIO",null,null,null,null,"SOBRE-EJECUCIÓN AUTORIZADA"]
[null,null,null,null,null,null,null,{"$f":"IF(OR($C$30=\"Mayor A:\",$C$30=\"Menor A:\"),\"Desde (>=):\",\nIF(OR($C$30=\"Mayor o Igual A:\",$C$30=\"Menor o Igual A:\"),\"Desde (>):\",\nIF($C$30=\"Igual A:\",\"No Aplica\",\nIF($C$30=\"\",\"\"))))","v":""},null,{"$f":"IF(F30>O30,O30,\nIF(F30<O30,F30,\nIF(F30=O30,\"No Aplica\",\"\")))","v":"No Aplica"},null,{"$f":"IF($C$30=\"Mayor A:\",\"Menor A:\",\nIF($C$30=\"Menor A:\",\"Mayor A:\",\nIF($C$30=\"Mayor o Igual A:\",\"Menor o Igual A:\",\nIF($C$30=\"Menor o Igual A:\",\"Mayor o Igual A:\",\nIF($C$30=\"Igual A:\",\"Igual A:\",\nIF($C$30=\"\",\"\"))))))","v":""},null,null,null,null,"El % de cumplimiento no debe superar el:"]
{"$rows_left_out":111}
{"sheet":"DE-FT-15 (Pág 2 de 2)","index":1,"n_rows":75,"n_cols":13,"rows_kept":75,"cut":false,"hidden":false,"merged":[[5,12,5,15],[74,1,74,15],[64,3,64,15],[65,3,65,15],[43,1,43,2],[62,1,62,2],[40,3,40,15],[39,3,39,15],[38,3,38,15],[32,3,32,15],[42,1,42,2],[42,3,42,15],[46,3,46,15],[34,1,34,2],[45,1,45,2],[45,3,45,15],[33,3,33,15],[34,3,34,15],[40,1,40,2],[37,3,37,15],[32,1,32,2],[33,1,33,2],[35,3,35,15],[59,3,59,15],[61,1,61,2],[61,3,61,15],[60,1,60,2],[23,3,23,15],[1,1,5,2],[1,3,5,11],[2,12,3,15],[7,1,7,15],[8,1,17,15],[19,3,19,15],[27,3,27,15],[30,1,30,2],[30,3,30,15],[21,3,21,15],[19,1,19,2],[22,3,22,15],[24,3,24,15],[20,3,20,15],[20,1,20,2],[25,1,25,2],[1,12,1,15],[21,1,21,2],[4,12,4,15],[22,1,22,2],[24,1,24,2],[48,3,48,15],[51,1,51,2],[27,1,27,2],[28,1,28,2],[31,1,31,2],[58,1,58,2],[26,3,26,15],[23,1,23,2],[26,1,26,2],[41,1,41,2],[38,1,38,2],[39,1,39,2],[41,3,41,15],[25,3,25,15],[31,3,31,15],[28,3,28,15],[36,1,36,2],[37,1,37,2],[29,1,29,2],[29,3,29,15],[36,3,36,15],[35,1,35,2],[65,1,65,2],[66,1,66,2],[68,1,68,2],[66,3,66,15],[43,3,43,15],[62,3,62,15],[46,1,46,2],[54,1,54,2],[56,3,56,15],[57,3,57,15],[54,3,54,15],[55,1,55,2],[56,1,56,2],[57,1,57,2],[47,1,47,2],[47,3,47,15],[51,3,51,15],[52,3,52,15],[48,1,48,2],[55,3,55,15],[53,3,53,15],[53,1,53,2],[58,3,58,15],[59,1,59,2],[73,1,73,2],[73,3,73,15],[44,1,44,2],[44,3,44,15],[49,1,49,2],[49,3,49,15],[67,1,67,2],[67,3,67,15],[72,1,72,2],[72,3,72,15],[71,1,71,2],[71,3,71,15],[52,1,52,2],[50,1,50,2],[50,3,50,15],[68,3,68,15],[69,3,69,15],[70,1,70,2],[70,3,70,15],[63,1,63,2],[63,3,63,15],[60,3,60,15],[64,1,64,2],[69,1,69,2]]}
[]
[null,null,null,"HOJA DE VIDA DEL INDICADOR",null,null,null,null,null,null,null,null,"Código: DE-FT-15"]
[null,null,null,null,null,null,null,null,null,null,null,null,"Versión: 9"]
[]
[null,null,null,null,null,null,null,null,null,null,null,null,"Pagina:  2 de 2"]
[null,null,null,null,null,null,null,null,null,null,null,null,"Vigente desde: 01/08/2024"]
[]
[null,"INSTRUCCIONES PARA EL DILIGENCIAMIENTO DEL FORMATO DE HOJA DE VIDA DEL INDICADOR"]
[null,"Documento donde se registra toda la información asociada a un indicador. Este documento permite llevar un registro detallado de los indicadores utilizados en la Entidad, así como reportar y hacer seguimiento de su avance.\n\nNota: el formato contiene ciertos campos que no deben ser diligenciados por el (la) usuario(a), pues se ajustan automáticamente dependiendo de la información ingresada en otros campos o es información predeterminada."]
[]
[]
[]
[]
[]
[]
[]
[]
[]
[]
[null,"SECCIÓN / CAMPO",null,"INSTRUCCIONES"]
[null,"INFORMACIÓN BÁSICA DEL INDICADOR",null,"En esta sección se registra información básica del indicador para conocer la forma en que se ubica en la estructura de gestión de la Entidad, el propósito, el tipo de indicador y los distintos tiempos y fechas de medición y reporte."]
[null,"PROCESO:",null,"Seleccione de la lista desplegable el proceso al que está asociado el indicador."]
[null,"TIPO DE PROCESO:",null,"Este campo presenta la asociación del proceso (Estratégico, Misional, de apoyo o de evaluación y seguimiento). Este campo se diligencia automáticamente."]
[null,"CÓDIGO DEL INDICADOR:",null,"El código del indicador es asignado por la Oficina Asesora de Planeación una vez validada la creación de un nuevo indicador. No debe diligenciar este campo."]
[null,"INSTRUMENTO DE PLANEACIÓN:",null,"Seleccione de la lista desplegable el plan, programa, sistema o proyecto al cual está asociado el indicador. \nEn caso de seleccionar la opción \"Proyecto de inversión\", registre en la casilla de la derecha el código o número del proyecto de inversión."]
[null,"OBJETIVO DEL PROCESO / PROYECTO DE INVERSIÓN / OBJETIVO ESTRATEGICO ASOCIADO:",null,"Registre el objetivo al que se le da cumplimiento, por medio de la meta que mide el indicador. Dependiendo del tipo de objetivo (estratégico, de proceso, etc.), debe registrar en este campo la información del objetivo definido en la caracterización del proceso, el Plan Estratégico Institucional PEI o el objetivo del proyecto de inversión, plan de desarrollo, etc."]
[null,"META ASOCIADA:",null,"Registre la meta asociada al instrumento de planeación y el objetivo registrado en la casilla anterior, cuyo cumplimiento se mide por medio del indicador. Dependiendo del instrumento de planeación elegido, debe registrar la meta asociada."]
[null,"NOMBRE DEL INDICADOR:",null,"Registre en este campo el nombre del indicador, que se construye a partir de la meta. \nEl nombre del indicador debe corresponder al que se registró en el instrumento de planeación seleccionado, por ejemplo: Plan de Acción (SGC), Plan Estratégico Institucional, etc.\nDe lo contrario debe redactar en nombre del indicador teniendo en cuenta la siguiente estructura y recomendaciones:\n1.Objeto(Sustantivo) + condición deseada del objeto (verbo conjugado) + elementos adicionales de contexto descriptivo.\n2.El nombre debe ser claro y sin ambigüedades, y referirse únicamente a lo que se va a medir. No debe utilizar palabras o expresiones que den lugar a diferentes interpretaciones o que no sea claro cómo se miden (por ejemplo: goce efectivo, gestión eficaz, etc.), así como magnitudes puntuales (por ejemplo: 16 planes, 1000 revisiones, etc.)."]
[null,"PROPÓSITO DEL INDICADOR:",null,"En este campo registre el objetivo específico del  indicador.(Que busca medir, por qué y para qué se mide).\n\"Da cuenta de la utilidad del indicador, donde se incluye el alcance del  indicador, precisando qué es, por qué y para qué se mide\". \nFuente: Guía para la Construcción y Análisis de Indicadores.DNP."]
[null,"ACLARACIONES PARA LA ADECUADA MEDICIÓN DEL INDICADOR:",null,"En este campo se debe incluir todas las aclaraciones que logren eliminar la subjetividad del indicador y que permitan entenderlo de una manera fácil y clara. (Ejemplo: 1) En caso de que mensualmente se programen porcentajes, aquí se debe aclarar el número de actividades con las que se logra ganar el porcentaje que se programó mensualmente. 2) Aquí se puede aclarar las fechas reales que mide el indicador, por ejemplo, recibir solicitudes del 1 al 25 de cada mes, siendo este el periodo que se evalúa para medir el indicador)."]
{"$rows_left_out":46}
{"sheet":"Hoja3","index":2,"n_rows":33,"n_cols":33,"rows_kept":33,"cut":false,"hidden":true,"merged":[]}
["Proceso","Tipología de proceso","Código de proceso","Instrumento de planeación","Tipología de indicador","Periodicidad","Tipo de fórmula","Sumatoria_de_Una_Variable","División_de_Variables","Sumatoria_de_Dos_Variables","Tendencia del Indicador","Cálculo meta acumulada","Comparativos","Fecha de Corte","Períodos",{"$f":"YEAR(TODAY())","v":2024},null,null,null,null,null,null,null,null,null,null,null,null,null,null,null,"Dependencias","Periodo de Creación del Indicador"]
["DE Direccionamiento Estratégico","Estratégico","01","Plan de Acción Institucional PAI","Eficacia","Mensual","Sumatoria_de_Una_Variable","Número de","Porcentaje","Número de","Creciente","Si Aplica","Menor A:","Enero","Ene","Feb","Mar","Abr","May","Jun","Jul","Ago","Sep","Oct","Nov","Dic"," "," "," "," "," ","Dirección General","2024-01-01"]
["CE Comunicación e Información Pública","Estratégico","02","Plan Estratégico Institucional PEI","Eficiencia","Trimestral","División_de_Variables","Pesos ($)","Número de","Pesos ($)","Decreciente","No Aplica","Menor o Igual A:","Febrero","2024 T1","2024 T2","2024 T3","2024 T4","2025 T1","2025 T2","2025 T3","2025 T4","2026 T1","2026 T2","2026 T3","2026 T4","2027 T1","2027 T2","2027 T3","2027 T4","2028 T1","Oficina Jurídica","2024-04-01"]
["CI Conocimiento e Innovación","Estratégico","03","Productos, Metas y Resultados - PMR","Efectividad","Semestral","Sumatoria_de_Dos_Variables","Otra","Otra","Otra",null,null,"Igual A:","Marzo","2024 S1","2024 S2","2025 S1","2025 S2","2026 S1","2026 S2","2027 S1","2027 S2","2028 S1","2028 S2","2029 S1","2029 S2","2030 S1","2030 S2","2031 S1","2031 S2","2032 S1","Oficina Asesora de Planeación","2024-07-01"]
["TI Tecnologías de la Información y las Comunicaciones","Estratégico","04","Sistema de Gestión de Calidad",null,"Anual","Tasa_de_Variación_Creciente",null,null,null,null,null,"Mayor o Igual A:","1er Trimestre 2024",2024,2025,2026,2027,2028,2029,2030,2031,2032,2033,2034,2035,2036,2037,2038,2039,2040,"Oficina de Control Interno","2024-10-01"]
["TH Gestión del Talento Humano","Estratégico","05","Sistema de Gestión de Seguridad y Salud en el Trabajo",null,null,"Tasa_de_Variación_Decreciente",null,null,null,null,null,"Mayor A:","1er Trimestre 2025",null,null,null,null,null,null,null,null,null,null,null,null,null,null,null,null,null,"Oficina de Control Disciplinario Interno","2025-01-01"]
["CR Conocimiento del Riesgo y Efectos del Cambio Climático","Misional","06","Sistema de Gestión de Seguridad de la Información",null,null,null,null,null,null,null,null,null,"1er Trimestre 2026",null,null,null,null,null,null,null,null,null,null,null,null,null,null,null,null,null,"Comunicaciones","2025-04-01"]
["RR Reducción del Riesgo y Adaptación al Cambio Climático","Misional","07","Sistema de Gestión Ambiental",null,null,null,null,null,null,null,null,null,"1er Trimestre 2027",null,null,null,null,null,null,null,null,null,null,null,null,null,null,null,null,null,"Oficina de Tecnologías de la Información y las Comunicaciones","2025-07-01"]
["ME Manejo de Emergencias y Desastres","Misional","08","Modelo Integrado de Planeación y Gestión - MIPG",null,null,null,null,null,null,null,null,null,"1er Trimestre 2028",null,null,null,null,null,null,null,null,null,null,null,null,null,null,null,null,null,"Subdirección Corporativa","2025-10-01"]
["GJ Gestión Jurídica","De apoyo","09","Proyecto de Inversión",null,null,null,null,null,null,null,null,null,"Abril",null,null,null,null,null,null,null,null,null,null,null,null,null,null,null,null,null,"Subdirección de Reducción del Riesgo y Adaptación al Cambio Climático","2026-01-01"]
["GC Gestión Contractual","De apoyo","10","Plan Estratégico de Seguridad Vial - PESV",null,null,null,null,null,null,null,null,null,"Mayo",null,null,null,null,null,null,null,null,null,null,null,null,null,null,null,null,null,"Subdirección de Análisis de Riesgos y Efectos del Cambio Climático","2026-04-01"]
["GD Gestión Documental","De apoyo","11","Políticas Públicas Distritales",null,null,null,null,null,null,null,null,null,"Junio",null,null,null,null,null,null,null,null,null,null,null,null,null,null,null,null,null,"Subdirección de Manejo de Emergencias y Desastres","2026-07-01"]
["GA Gestión Administrativa","De apoyo","12","Plan de Ordenamiento Territorial - POT",null,null,null,null,null,null,null,null,null,"2do Trimestre 2021",null,null,null,null,null,null,null,null,null,null,null,null,null,null,null,null,null,null,"2026-10-01"]
["GF Gestión Financiera","De apoyo",null,"Sistema Distrital de Gestión de Riesgos y Cambio Climático - SDGR-CC",null,null,null,null,null,null,null,null,null,"2do Trimestre 2022",null,null,null,null,null,null,null,null,null,null,null,null,null,null,null,null,null,null,"2027-01-01"]
["AC Atención al Ciudadano","De apoyo",null,"Plan Distrital de Desarrollo (PDD) 2024 - 2027",null,null,null,null,null,null,null,null,null,"2do Trimestre 2023",null,null,null,null,null,null,null,null,null,null,null,null,null,null,null,null,null,null,"2027-04-01"]
["CD Control Disciplinario Interno","De Evaluación",null,"Plan Distrital de Gestión del Riesgo de Desastres y del Cambio Climático",null,null,null,null,null,null,null,null,null,"2do Trimestre 2024",null,null,null,null,null,null,null,null,null,null,null,null,null,null,null,null,null,null,"2027-07-01"]
["EI Evaluación Independiente","De Evaluación",null,"Estrategia Distrital para la Respuesta a Emergencias",null,null,null,null,null,null,null,null,null,"2do Trimestre 2025",null,null,null,null,null,null,null,null,null,null,null,null,null,null,null,null,null,null,"2027-10-01"]
[null,null,null,"Estrategia Institucional de Respuesta",null,null,null,null,null,null,null,null,null,"Julio"]
[null,null,null,null,null,null,null,null,null,null,null,null,null,"Agosto"]
["No Aplica",null,null,null,null,null,null,null,null,null,null,null,null,"Septiembre"]
["N.A.",null,null,null,null,null,null,null,null,null,null,null,null,"3er Trimestre 2021"]
[null,null,null,null,null,null,null,null,null,null,null,null,null,"3er Trimestre 2022"]
[null,null,null,null,null,null,null,null,null,null,null,null,null,"3er Trimestre 2023"]
[null,null,null,null,null,null,null,null,null,null,null,null,null,"3er Trimestre 2024"]
[null,null,null,null,null,null,null,null,null,null,null,null,null,"3er Trimestre 2025"]
[null,null,null,null,null,null,null,null,null,null,null,null,null,"Octubre"]
[null,null,null,null,null,null,null,null,null,null,null,null,null,"Noviembre"]
[null,null,null,null,null,null,null,null,null,null,null,null,null,"Diciembre"]
[null,null,null,null,null,null,null,null,null,null,null,null,null,"4to Trimestre 2021"]
[null,null,null,null,null,null,null,null,null,null,null,null,null,"4to Trimestre 2022"]
{"$rows_left_out":3}